{"text_format":"1","workbook":"xlsx","n_sheets":5,"sheets":["Menu","STARS Incentive Budget","Budget Narrative","Cost of Care Calculator","Budget Codes & Formulas"],"not_rendered":{"charts":0,"images":2,"macros":1,"external_links":0,"defined_names":4,"comments":0,"pivot_tables":0},"unopened":[],"bounds":{"document_bytes":16777216,"sheet_cells":100000,"rows_first":2000,"rows_last":500,"rows_between":2000,"halvings":0,"cell_chars":16384,"cell_head_chars":4096},"cells_cut":0,"cells_raw":0,"read":"whole","date_system":"1900"}

{"sheet":"Menu","index":0,"n_rows":22,"n_cols":9,"rows_kept":22,"cut":false,"hidden":false,"merged":[[0,8,0,18],[1,8,43,18],[20,0,20,7],[0,0,0,7],[1,0,1,7],[10,0,10,7],[2,0,9,5],[11,0,19,5],[21,0,29,5]]}
["Best Beginnings STARS to Quality\nBudget and Budget Narrative\nRevised AUGUST 2020",null,null,null,null,null,null,null,"Budget Instructions & Tips\nThis document will only be accepted electronically as an Excel file type. \nNo other forms of this document will be accepted."]
["STARS Incentive Budget",null,null,null,null,null,null,null,"General Tips:\n▪ To complete this document, click \"enable content\" if it appears at the top of the document\n▪ Before completing this document, save it to your computer as an \"Excel Macro-Enabled Workbook\" or your filled-in cells will not be saved\n▪ To copy/paste information into the Budget Narrative tab, either a “double click” while on the cell or “F2” while on the cell, will allow you to paste wording that was copied from another source, like a Word document.\n▪ To view the Budget and Budget Narrative tab at the same time, select ”New Window,” then “View Side by Side” on the View tab in Excel.                                                                                                                                                                                                                         ▪To move to a different sheet, either click the corresponding button on this Menu page, or click on the name of the tab below.                                                                                                                                                                                             \nCells in orange are filled out by the provider, all orange cells must be completed\nCells in red are protected from editing and are auto filled \n\nSTARS Incentive Budget Tab: \n▪ Fill out the orange cells at the top of the page. Information entered for facility type, STAR level, years at STAR level, STAR level award month and year, will allow the budget to autofill the budget dates, incentive amount, and personnel minimum amount. \n▪ There are 2 budget line items: Personnel and Operations.\n▪ As each quarter and line item are entered, the budget total will automatically adjust. \n▪ If the quarterly amounts entered do not equal the budget total, the total budget will either show \"Over Budget\" or \"Under Budget\" \n▪ Once the budget is complete, the provider must electronically sign by typing their name in the signature line, and enter the date. \n\nBudget Narrative:\n▪ The PV # and Program Name will be auto filled based on what was entered on the budget tab. \n▪ Enter the name of the person completing this tab.\n▪ The Budget information in the Budget Item vs Budget section will be auto filled based on what was entered in the STARS Incentive Budget tab. The Budget Item amounts will fill in as you enter budget categories and costs of each specific task or item for improvement\n▪ For the Budget Category column, select the source by using the drop down button.                                                                \n▪ To add rows, click \"Add INSERT ROW\" button on the right of the sheet. \n                                                                                                                                                                                                                 Cost of Care Calculator\n▪ See tab for instructions"]
["STARS incentives are to be used for continuous quality improvement, staff support and salaries, professional development, equipment, etc.  Purchases and investments are meant to assist a program in moving to the next level, maintaining the STAR level achieved and increasing quality.  The STAR Kits include a resource containing Budget Ideas for Personnel Costs.  STARS incentives may not be used for construction.  Incomplete budgets will not be approved. All incentives for the Best Beginnings STARS to Quality Program are subject to eligibility requirements as outlined in policy and are dependent on funding.  "]
[]
[]
[]
[]
[]
[]
[]
["Budget Narrative Section"]
["1. STARS Budget Item - must specify what the funds are being used for                                                      2. Budget Amount - must be exact, and totals must match totals on the Budget                               3. Budget Category - must select either Personnel or Operations                                                            4. Quarter Budgeted In - must select either 1, 2, 3, or 4. Funds do not have to be spent within that quarter; however, this will assist with overall program budgeting."]
[]
[]
[]
[]
[]
[]
[]
[]
["Cost of Care Calculator"]
["This tool is designed to help you determine what the cost of care per child in your program may be.  Reporting cost of care for child care programs is now a federal requirement. All information on the Cost of Care Calculator is confidential, and only the cost of care per child will be used for reporting purposes. The Cost of Care Calculator must be completed in order for the Budget and QIP to be approved. "]

{"sheet":"STARS Incentive Budget","index":1,"n_rows":44,"n_cols":7,"rows_kept":44,"cut":false,"hidden":false,"merged":[[22,6,23,6],[0,0,0,7],[1,0,1,7],[3,5,3,6],[5,5,5,6],[14,2,14,4],[14,5,14,6],[11,2,11,6],[12,2,12,6],[13,2,13,3],[10,2,10,4],[7,3,7,4],[8,3,8,4],[39,1,39,5],[31,1,31,2],[34,1,34,2],[19,1,19,2],[20,1,20,2],[28,4,28,5],[36,1,36,2],[22,1,23,1]]}
["Best Beginnings STARS to Quality\nIncentive Budget"]
[]
[]
[null,"PV#",null,null,null,"CENTERS ONLY"]
[null,"Facility Type",null,null,null,"Facility Size"]
[null,null,null,null,null,"License Capacity or Average Daily Attendance for the previous 3 months, whichever is less"]
[]
[null,"STAR Level",null,"STAR Level Award Month",null,"July"]
[null,"Years at Level",null,"STAR Level Award Year"]
[]
[null,"Director Name",null,null,null,"PS#"]
[null,"Program Name"]
[null,"Mailing Address"]
[null,"City, State, Zip"]
[null,"Fiscal Agent Name and Phone (for centers)"]
[]
[]
[null,"Budget Dates ",{"$f":"F8","v":"July"},{"$f":"$F$9","v":0},"TO",{"$f":"_xlfn.IFS(F8=\"January\",\"December\",F8=\"July\",\"June\")","v":"June"},{"$f":"_xlfn.IFS(F8=\"January\",F9,F8=\"July\",F9+1)","v":1}]
[]
[null,"STAR Incentive",null,"Quarterly",{"$f":"'Budget Codes & Formulas'!$I$7","v":{"$error":"#N/A"}},"Yearly",{"$f":"'Budget Codes & Formulas'!$I$11","v":{"$error":"#N/A"}}]
[null," Personnel Budget ",null,"Quarterly",{"$f":"'Budget Codes & Formulas'!$I$12","v":{"$error":"#N/A"}},"Yearly",{"$f":"'Budget Codes & Formulas'!$I$16","v":{"$error":"#N/A"}}]
[]
[null,"BUDGET CATEGORY\n(Line Item Description)","Quarter 1","Quarter 2","Quarter 3","Quarter 4","Budget\nTotal"]
[null,null,{"$f":"_xlfn.IFS($C$18=\"January\",\"Jan-Feb-Mar\",$C$18=\"July\",\"Jul-Aug-Sept\")","v":"Jul-Aug-Sept"},{"$f":"_xlfn.IFS($C$18=\"January\",\"Apr-May-June\",$C$18=\"July\",\"Oct-Nov-Dec\")","v":"Oct-Nov-Dec"},{"$f":"_xlfn.IFS($C$18=\"January\",\"July-Aug-Sept\",$C$18=\"July\",\"Jan-Feb-Mar\")","v":"Jan-Feb-Mar"},{"$f":"_xlfn.IFS($C$18=\"January\",\"Oct-Nov-Dec\",$C$18=\"July\",\"Apr-May-June\")","v":"Apr-May-June"}]
[null,"1.  Personnel Expenses",null,null,null,null,{"$f":"SUM(C25:F25)","v":0}]
[null,"2.  Operations ",null,null,null,null,{"$f":"SUM(C26:F26)","v":0}]
[null,"Sub Total",{"$f":"SUM(C25:C26)","v":0},{"$f":"SUM(D25:D26)","v":0},{"$f":"SUM(E25:E26)","v":0},{"$f":"SUM(F25:F26)","v":0},{"$f":"SUM(G25:G26)","v":0}]
[null,"Over/(Under) Budget    ",{"$f":"_xlfn.IFS($C$27-$E$20=\"E20\",0,$C$27-$E$20>\"0\",$C$27-$E$20,$C$27-$E$20<\"0\",$C$27-$E$20)","v":{"$error":"#N/A"}},{"$f":"SUM($D$27-$E$20)","v":{"$error":"#N/A"}},{"$f":"SUM($E$27-$E$20)","v":{"$error":"#N/A"}},{"$f":"SUM($F$27-$E$20)","v":{"$error":"#N/A"}},{"$f":"SUM(C28:F28)","v":{"$error":"#N/A"}}]
[null,null,null,null,"TOTAL BUDGET",null,{"$f":"_xlfn.IFS(SUM(C28:F28)>0,\"Over Budget\",SUM(C28:F28)<0,\"Under Budget\",SUM(C28:F28)=0,SUM(G25:G26))","v":{"$error":"#N/A"}}]
[]
{"$rows_left_out":15}
{"sheet":"Budget Narrative","index":2,"n_rows":18,"n_cols":5,"rows_kept":18,"cut":false,"hidden":false,"merged":[[0,1,0,4],[1,1,1,4],[8,1,8,4],[4,2,4,4],[5,2,5,4],[3,2,3,4]]}
[null,"Best Beginnings STARS to Quality\nBudget Narrative"]
[]
[]
[null,"PV #:",{"$f":"'STARS Incentive Budget'!$C$4","v":0}]
[null,"Program Name:",{"$f":"'STARS Incentive Budget'!$C$12","v":0}]
[null,"Name of Person Completing Plan:"]
[]
[]
[null,"Budget vs Budget Items Narrative"]
[]
[null,null,"Budget Amounts","Narrative Amounts","Budget / Narrative"]
[null,null,"from budget tab","from table below","difference"]
[null,"Personnel Expenses ",{"$f":"'STARS Incentive Budget'!$G$25","v":0},{"$f":"SUMIFS(QIP_Improvement[[#All],[Budget Amount\n(must be exact)]],QIP_Improvement[[#All],[ Budget Category    (Personnel or Operations)]],\"Personnel Expenses\")","v":0},{"$f":"SUM(C13-D13)","v":0}]
[null,"Operations",{"$f":"'STARS Incentive Budget'!$G$26","v":0},{"$f":"SUMIFS(QIP_Improvement[[#All],[Budget Amount\n(must be exact)]],QIP_Improvement[[#All],[ Budget Category    (Personnel or Operations)]],\"Operations\")","v":0},{"$f":"SUM(C14-D14)","v":0}]
[null,"Total",{"$f":"'STARS Incentive Budget'!$G$27","v":0},{"$f":"SUM(D13:D14)","v":0},{"$f":"SUM(C15-D15)","v":0}]
[]
[]
[null,"STARS Budget Item                                                       (what specifically is being budgeted for)","Budget Amount\n(must be exact)"," Budget Category    (Personnel or Operations)","Quarter \nBudgeted In"]

{"sheet":"Cost of Care Calculator","index":3,"n_rows":104,"n_cols":10,"rows_kept":104,"cut":false,"hidden":false,"merged":[[86,9,87,9],[83,7,83,8],[84,7,84,8],[86,5,87,5],[86,6,87,6],[86,7,87,7],[86,8,87,8],[82,7,82,8],[22,1,22,2],[70,7,70,8],[71,7,71,8],[72,7,72,8],[73,7,73,8],[74,7,74,8],[75,7,75,8],[80,7,80,8],[81,7,81,8],[30,1,30,2],[30,4,30,9],[48,4,48,9],[67,1,67,2],[67,4,67,5],[67,7,67,9],[77,4,77,9],[12,2,12,4],[12,5,12,7],[23,1,29,9],[0,1,0,9],[1,1,1,9],[3,2,3,3],[5,6,5,7],[3,6,3,7],[4,2,4,3],[4,6,4,7],[8,2,8,7],[9,2,9,7],[10,2,10,7],[11,2,11,4],[11,6,11,7]]}
[null,"Best Beginnings STARS to Quality\nCost of Care Calculator"]
[]
[]
[null,"PV#",{"$f":"'STARS Incentive Budget'!$C$4","v":0},null,null,"Facility Type",{"$f":"'STARS Incentive Budget'!$C$5","v":0}]
[null,"PS#",{"$f":"'STARS Incentive Budget'!$G$11","v":0},null,null,"Facility Size",{"$f":"'STARS Incentive Budget'!$G$5","v":0}]
[null,null,null,null,null,"STAR Level","STAR 2"]
[]
[]
[null,"Director Name",{"$f":"'STARS Incentive Budget'!$C$11","v":0}]
[null,"Program Name",{"$f":"'STARS Incentive Budget'!$C$12","v":0}]
[null,"Mailing Address",{"$f":"'STARS Incentive Budget'!$C$13","v":0}]
[null,"City, State, Zip",{"$f":"'STARS Incentive Budget'!C14","v":0},null,null,{"$f":"'STARS Incentive Budget'!F14","v":0},{"$f":"'STARS Incentive Budget'!G14","v":0}]
[null,"Fiscal Agent: Name and Phone",{"$f":"'STARS Incentive Budget'!C15","v":0},null,null,{"$f":"'STARS Incentive Budget'!F15","v":0}]
[]
[null,null,"Monthly",null,"Yearly (Estimate)"]
[null,"Total Revenue",{"$f":"SUM(C33)","v":{"$error":"#N/A"}},null,{"$f":"SUM(C16*12)","v":{"$error":"#N/A"}}]
[null,"Total Expenses",{"$f":"SUM(C70)","v":0},null,{"$f":"SUM(C17*12)","v":0}]
[null,"Net Profit / Loss",{"$f":"SUM(C16-C17)","v":{"$error":"#N/A"}},null,{"$f":"SUM(C18*12)","v":{"$error":"#N/A"}}]
[]
[null,"Cost Per Child",{"$f":"SUM(C17/J38)","v":{"$error":"#DIV/0!"}},null,{"$f":"SUM(E17/J38)","v":{"$error":"#DIV/0!"}}]
[]
[null,"INSTRUCTIONS:  "]
[null,"Cells that are light orange are fillable.  "]
[null,"Replace the current numbers with those from your own program to determine the cost per child in your program.  All programs charge differently, so please provide the best estimate of your daily rate. The blank orange rows in revenue and expenses can be used to add program-specific items. The white lines in Total Revenue and in the Enrollment section will automatically fill in once the orange cells for Rate per day, number of children, and average days of operation per month are completed.  Expenses will populate from the numbers entered in Food service, vehicle, and personnel.  Additional revenue and expenses can be added in the orange lines. The totals in green above will automatically calculate based on what is entered below in the orange cells. For additional assistance, a sample Cost of Care Calculator is located on the STARS website in the Incentives tab."]
[]
[]
[]
[]
[]
[]
{"$rows_left_out":75}
{"sheet":"Budget Codes & Formulas","index":4,"n_rows":162,"n_cols":27,"rows_kept":162,"cut":false,"hidden":true,"merged":[[64,7,64,8],[17,7,17,8],[1,0,1,5],[1,7,1,9],[40,7,40,9],[34,7,34,8],[17,0,17,5],[33,0,33,5],[46,0,46,5],[63,7,63,8]]}
[null,null,null,null,null,null,null,null,null,null,null,"Row #",1,2,3,4,5,6,7,8,9,10,11,12,13,14,15]
["STAR Budget Control Codes",null,null,null,null,null,null,"STAR Budget Formula Results Table",null,null,null,null,"ID","Facility Type","Start Level","Number of Years at Level","Qtr 1 Budget","Qtr 2 Budget","Qtr 3 Budger","Qtr 4 Budget","Yearly Budget","Qtr 1 Quarterly Personnel/Staff Costs","Qtr 2 Quarterly Personnel/Staff Costs","Qtr 3 Quarterly Personnel/Staff Costs","Qtr 4 Quarterly Personnel/Staff Costs","Yearly Personnel/Staff Costs","Value"]
["Month","Year","Facility Type","STAR Level","Renewals","Facility Size",null,"Facility Type",{"$f":"I20","v":{"$error":"#N/A"}},"Row",null,null,1,"Family Child Care","STAR 2",0,{"$f":"$J$42","v":625},{"$f":"$J$42","v":625},{"$f":"$J$42","v":625},{"$f":"$J$42","v":625},{"$f":"SUM(Q3:T3)","v":2500},{"$f":"SUM($J$42*$I$36)","v":125},{"$f":"SUM($J$42*$I$36)","v":125},{"$f":"SUM($J$42*$I$36)","v":125},{"$f":"SUM($J$42*$I$36)","v":125},{"$f":"SUM(V3:Y3)","v":500},{"$f":"IF(AND($N$3:$N$162=$I$3)*($O$3:$O$162=$I$4)*($P$3:$P$162=$I$5),$M$3:$M$162,0)","v":{"$error":"#N/A"}}]
["January",2018,"Family Child Care","STAR 2",0,null,null,"STAR Level",{"$f":"'STARS Incentive Budget'!$C$8","v":0},null,null,null,2,"Family Child Care","STAR 2",1,{"$f":"$Q$3","v":625},{"$f":"$R$3","v":625},{"$f":"$S$3","v":625},{"$f":"$T$3","v":625},{"$f":"SUM(Q4:T4)","v":2500},{"$f":"SUM(Q4*$I$36)","v":125},{"$f":"SUM(R4*$I$36)","v":125},{"$f":"SUM(S4*$I$36)","v":125},125,{"$f":"SUM(V4:Y4)","v":500},{"$f":"IF(AND($N$3:$N$162=$I$3)*($O$3:$O$162=$I$4)*($P$3:$P$162=$I$5),$M$3:$M$162,0)","v":{"$error":"#N/A"}}]
["July",2019,"Group Child Care","STAR 3",1,"16 - 29",null,"Years at Level",{"$f":"IF(J5<7,'STARS Incentive Budget'!C9,\"7+\")","v":0},{"$f":"'STARS Incentive Budget'!$C$9","v":0},null,null,3,"Family Child Care","STAR 2",2,{"$f":"$Q$3","v":625},{"$f":"$R$3","v":625},{"$f":"$S$3","v":625},{"$f":"$T$3","v":625},{"$f":"SUM(Q5:T5)","v":2500},125,125,125,125,500,{"$error":"#N/A"}]
[null,2020,"Child Care Center","STAR 4",2,"30 - 59",null,"Value",{"$f":"SUM(AA3:AA162)","v":{"$error":"#N/A"}},null,null,null,4,"Family Child Care","STAR 2",3,{"$f":"$Q$3","v":625},{"$f":"$R$3","v":625},{"$f":"$S$3","v":625},{"$f":"$T$3","v":625},2500,125,125,125,125,500,{"$error":"#N/A"}]
["Budget Line Item",2021,null,"STAR 5",3,"60+",null,"Qtr 1 Budget",{"$f":"VLOOKUP($I$6,$M$2:$AA$162,J7)","v":{"$error":"#N/A"}},5,null,{"$f":"ROUND(($Q$6-($Q$6*$I$71)),0)","v":0},5,"Family Child Care","STAR 2",4,{"$f":"$Q$3","v":625},{"$f":"$R$3","v":625},{"$f":"$S$3","v":625},{"$f":"$T$3","v":625},{"$f":"SUM(Q7:T7)","v":2500},{"$f":"SUM(Q7*$I$36)","v":125},{"$f":"SUM(R7*$I$36)","v":125},{"$f":"SUM(S7*$I$36)","v":125},{"$f":"SUM(T7*$I$36)","v":125},{"$f":"SUM(V7:Y7)","v":500},{"$error":"#N/A"}]
["Operations",2022,null,null,4,null,null,"Qtr 2 Budget",{"$f":"VLOOKUP($I$6,$M$2:$AA$162,J8)","v":{"$error":"#N/A"}},6,null,null,6,"Family Child Care","STAR 2",5,{"$f":"ROUND(($Q$7-($Q$7*$I$72)),0)","v":469},{"$f":"ROUND(($R$7-($R$7*$I$72)),0)","v":469},{"$f":"ROUND(($S$7-($S$7*$I$72)),0)","v":469},{"$f":"ROUND(($T$6-($T$6*$I$72)),0)","v":469},1876,{"$f":"SUM(Q8*$I$36)","v":93.800000000000011},{"$f":"SUM(R8*$I$36)","v":93.800000000000011},93.800000000000011,93.800000000000011,375.20000000000005,{"$error":"#N/A"}]
["Personnel Expenses",2023,null,null,5,null,null,"Qtr 3 Budget",{"$error":"#N/A"},7,null,null,7,"Family Child Care","STAR 2",6,{"$f":"ROUND(($Q$6-($Q$6*$I$72)),0)","v":469},{"$f":"ROUND(($R$6-($R$6*$I$72)),0)","v":469},{"$f":"ROUND(($S$6-($S$6*$I$72)),0)","v":469},{"$f":"ROUND(($T$6-($T$6*$I$72)),0)","v":469},1876,{"$f":"SUM(Q9*$I$36)","v":93.800000000000011},93.800000000000011,93.800000000000011,93.800000000000011,{"$f":"SUM(V9:Y9)","v":375.20000000000005},{"$error":"#N/A"}]
[null,2024,null,null,6,null,null,"Qtr 4 Budget",{"$error":"#N/A"},8,null,null,8,"Family Child Care","STAR 2","7+",{"$f":"ROUND(($Q$6-($Q$6*$I$72)),0)","v":469},{"$f":"ROUND(($R$6-($R$6*$I$72)),0)","v":469},{"$f":"ROUND(($S$6-($S$6*$I$72)),0)","v":469},{"$f":"ROUND(($T$6-($T$6*$I$72)),0)","v":469},1876,{"$f":"SUM(Q10*$I$36)","v":93.800000000000011},93.800000000000011,93.800000000000011,93.800000000000011,375.20000000000005,{"$error":"#N/A"}]
["Quarter Budgeted In",2025,null,null,7,null,null,"Yearly Budget",{"$error":"#N/A"},9,null,null,9,"Family Child Care","STAR 3",0,{"$f":"$J$43","v":938},{"$f":"$J$43","v":938},{"$f":"$J$43","v":938},{"$f":"$J$43","v":938},{"$f":"SUM(Q11:T11)","v":3752},{"$f":"SUM(Q11*$I$37)","v":281.39999999999998},281.39999999999998,281.39999999999998,281.39999999999998,{"$f":"SUM(V11:Y11)","v":1125.5999999999999},{"$error":"#N/A"}]
["Quarter 1",2026,null,null,8,null,null,"Qtr 1 Personnel/Staff Costs",{"$error":"#N/A"},10,null,null,10,"Family Child Care","STAR 3",1,{"$f":"$Q$11","v":938},{"$f":"$R$11","v":938},{"$f":"$S$11","v":938},{"$f":"$T$11","v":938},3752,281.39999999999998,281.39999999999998,281.39999999999998,281.39999999999998,1125.5999999999999,{"$error":"#N/A"}]
["Quarter 2",2027,null,null,9,null,null,"Qtr 2 Personnel/Staff Costs",{"$error":"#N/A"},11,null,null,11,"Family Child Care","STAR 3",2,{"$f":"$Q$11","v":938},{"$f":"$R$11","v":938},{"$f":"$S$11","v":938},{"$f":"$T$11","v":938},3752,281.39999999999998,281.39999999999998,281.39999999999998,281.39999999999998,1125.5999999999999,{"$error":"#N/A"}]
["Quarter 3",2028,null,null,10,null,null,"Qtr 3 Personnel/Staff Costs",{"$error":"#N/A"},12,null,null,12,"Family Child Care","STAR 3",3,{"$f":"$Q$11","v":938},{"$f":"$R$11","v":938},{"$f":"$S$11","v":938},{"$f":"$T$11","v":938},3752,281.39999999999998,281.39999999999998,281.39999999999998,281.39999999999998,1125.5999999999999,{"$error":"#N/A"}]
["Quarter 4",null,null,null,11,null,null,"Qtr 4 Personnel/Staff Costs",{"$error":"#N/A"},13,null,null,13,"Family Child Care","STAR 3",4,{"$f":"$Q$11","v":938},938,938,938,3752,281.39999999999998,281.39999999999998,281.39999999999998,281.39999999999998,1125.5999999999999,{"$error":"#N/A"}]
[null,null,null,null,12,null,null,"Personnel/Staff Costs",{"$error":"#N/A"},14,null,null,14,"Family Child Care","STAR 3",5,938,938,938,938,3752,281.39999999999998,281.39999999999998,281.39999999999998,281.39999999999998,1125.5999999999999,{"$error":"#N/A"}]
[null,null,null,null,null,null,null,null,null,null,null,null,15,"Family Child Care","STAR 3",6,938,938,938,938,3752,281.39999999999998,281.39999999999998,281.39999999999998,281.39999999999998,1125.5999999999999,{"$error":"#N/A"}]
["QIP Areas of Strength Control Codes",null,null,null,null,null,null,"STAR Budget - Facility Lookup Table",null,null,null,null,16,"Family Child Care","STAR 3","7+",938,938,938,938,3752,281.39999999999998,281.39999999999998,281.39999999999998,281.39999999999998,1125.5999999999999,{"$error":"#N/A"}]
["Source of Information",null,null,null,null,null,null,"Lookup Value","Result Value",null,null,null,17,"Family Child Care","STAR 4",0,{"$f":"$J$44","v":1250},{"$f":"$J$44","v":1250},{"$f":"$J$44","v":1250},{"$f":"$J$44","v":1250},5000,{"$f":"SUM(Q19*$I$38)","v":500},500,500,500,2000,{"$error":"#N/A"}]
["ERS",null,null,null,null,null,null,{"$f":"CONCATENATE('STARS Incentive Budget'!C5,\" \",'STARS Incentive Budget'!G5)","v":" "},{"$f":"LOOKUP(H20,H22:H33,I22:I33)","v":{"$error":"#N/A"}},null,null,null,18,"Family Child Care","STAR 4",1,{"$f":"$Q$19","v":1250},{"$f":"$R$19","v":1250},{"$f":"$S$19","v":1250},{"$f":"$T$19","v":1250},5000,500,500,500,500,2000,{"$error":"#N/A"}]
["PAS",null,null,null,null,null,null,null,null,null,null,null,19,"Family Child Care","STAR 4",2,{"$f":"$Q$19","v":1250},{"$f":"$R$19","v":1250},{"$f":"$S$19","v":1250},{"$f":"$T$19","v":1250},5000,500,500,500,500,2000,{"$error":"#N/A"}]
["BAS",null,null,null,null,null,null,"Chid Care Center",{"$f":"IF(AND('STARS Incentive Budget'!$C$5=\"Child Care Center\",'STARS Incentive Budget'!$G$5=\"0\"),$I$32,0)","v":0},null,null,null,20,"Family Child Care","STAR 4",3,1250,1250,1250,1250,5000,500,500,500,500,2000,{"$error":"#N/A"}]
["PDP",null,null,null,null,null,null,"Child Care Center 16 - 29",{"$f":"IF(AND('STARS Incentive Budget'!$C$5=\"Child Care Center\",'STARS Incentive Budget'!$G$5=\"16 - 29\"),\"Child Care Center - Small\",0)","v":0},null,null,null,21,"Family Child Care","STAR 4",4,1250,1250,1250,1250,5000,500,500,500,500,2000,{"$error":"#N/A"}]
["Knowledge Base",null,null,null,null,null,null,"Child Care Center 30 - 59",{"$f":"IF(AND('STARS Incentive Budget'!$C$5=\"Child Care Center\",'STARS Incentive Budget'!$G$5=\"30 - 59\"),\"Child Care Center - Medium\",0)","v":0},null,null,null,22,"Family Child Care","STAR 4",5,1250,1250,1250,1250,5000,500,500,500,500,2000,{"$error":"#N/A"}]
["Self-Assessment",null,null,null,null,null,null,"Child Care Center 60+",{"$f":"IF(AND('STARS Incentive Budget'!$C$5=\"Child Care Center\",'STARS Incentive Budget'!$G$5=\"60+\"),\"Child Care Center - Large\",0)","v":0},null,null,null,23,"Family Child Care","STAR 4",6,1250,1250,1250,1250,5000,500,500,500,500,2000,{"$error":"#N/A"}]
["Coach/Consultant Feedback",null,null,null,null,null,null,"Family Child Care",{"$f":"IF(AND('STARS Incentive Budget'!$C$5=\"Family Child Care\",'STARS Incentive Budget'!$G$5=\"\"),\"Family Child Care\",0)","v":0},null,null,null,24,"Family Child Care","STAR 4","7+",1250,1250,1250,1250,5000,500,500,500,500,2000,{"$error":"#N/A"}]
["STARS criteria/checklist items",null,null,null,null,null,null,"Family Child Care 16 - 29",{"$f":"IF(AND('STARS Incentive Budget'!$C$5=\"Family Child Care\",'STARS Incentive Budget'!$G$5=\"16 - 29\"),\"Family Child Care\",0)","v":0},null,null,null,25,"Family Child Care","STAR 5",0,{"$f":"$J$45","v":1563},{"$f":"$J$45","v":1563},{"$f":"$J$45","v":1563},{"$f":"$J$45","v":1563},6252,{"$f":"SUM(Q27*$I$39)","v":781.5},781.5,781.5,781.5,3126,{"$error":"#N/A"}]
["Other",null,null,null,null,null,null,"Family Child Care 30 - 59",{"$f":"IF(AND('STARS Incentive Budget'!$C$5=\"Family Child Care\",'STARS Incentive Budget'!$G$5=\"30 - 59\"),\"Family Child Care\",0)","v":0},null,null,null,26,"Family Child Care","STAR 5",1,{"$f":"$Q$27","v":1563},{"$f":"$R$27","v":1563},{"$f":"$S$27","v":1563},{"$f":"$T$27","v":1563},6252,781.5,781.5,781.5,781.5,3126,{"$error":"#N/A"}]
[null,null,null,null,null,null,null,"Family Child Care 60+",{"$f":"IF(AND('STARS Incentive Budget'!$C$5=\"Family Child Care\",'STARS Incentive Budget'!$G$5=\"60+\"),\"Family Child Care\",0)","v":0},null,null,null,27,"Family Child Care","STAR 5",2,1563,1563,1563,1563,6252,781.5,781.5,781.5,781.5,3126,{"$error":"#N/A"}]
[null,null,null,null,null,null,null,"Group Child Care",{"$f":"IF(AND('STARS Incentive Budget'!$C$5=\"Group Child Care\",'STARS Incentive Budget'!$G$5=\"\"),\"Group Child Care\",0)","v":0},null,null,null,28,"Family Child Care","STAR 5",3,1563,1563,1563,1563,6252,781.5,781.5,781.5,781.5,3126,{"$error":"#N/A"}]
{"$rows_left_out":132}